Reaction Details
TargetSubstance-P receptor
LigandBDBM50049468
Substrate/Competitorn/a
Meas. Tech.ChEMBL_205722 (CHEMBL807968)
IC50 0.87±n/a nM
Citation Hale, JJMills, SGMacCoss, MShah, SKQi, HMathre, DJCascieri, MASadowski, SStrader, CDMacIntyre, DEMetzger, JM 2(S)-((3,5-bis(trifluoromethyl)benzyl)-oxy)-3(S)-phenyl-4- ((3-oxo-1,2,4-triazol-5-yl)methyl)morpholine (1): a potent, orally active, morpholine-based human neurokinin-1 receptor antagonist. J Med Chem39:1760-2 (1996) 
 
Substance-P receptor
Name:Substance-P receptor
Type:G Protein-Coupled Receptor (GPCR)
Mol. Mass.:46254.43
Organism:Homo sapiens (Human)
Description:P25103
Residue:407
BDBM50049468
NameBDBM50049468
Synonyms:(2S,3S)-3-(3,5-Bis-trifluoromethyl-benzyloxy)-2-phenyl-piperidine 3-(3,5-Bis-trifluoromethyl-benzyloxy)-2-phenyl-piperidine L-733060
TypeSmall organic molecule
Emp. Form.C20H19F6NO
Mol. Mass.403.3614
SMILESFC(F)(F)c1cc(CO[C@H]2CCCN[C@H]2c2ccccc2)cc(c1)C(F)(F)F