Reaction Details
TargetSubstance-P receptor
LigandBDBM50049475
Substrate/Competitorn/a
Meas. Tech.ChEMBL_205722 (CHEMBL807968)
IC50 2.4±n/a nM
Citation Hale, JJMills, SGMacCoss, MShah, SKQi, HMathre, DJCascieri, MASadowski, SStrader, CDMacIntyre, DEMetzger, JM 2(S)-((3,5-bis(trifluoromethyl)benzyl)-oxy)-3(S)-phenyl-4- ((3-oxo-1,2,4-triazol-5-yl)methyl)morpholine (1): a potent, orally active, morpholine-based human neurokinin-1 receptor antagonist. J Med Chem39:1760-2 (1996) 
 
Substance-P receptor
Name:Substance-P receptor
Type:G Protein-Coupled Receptor (GPCR)
Mol. Mass.:46254.43
Organism:Homo sapiens (Human)
Description:P25103
Residue:407
BDBM50049475
NameBDBM50049475
Synonyms:(2S,3S)-2-(3,5-Bis-trifluoromethyl-benzyloxy)-3-phenyl-morpholine | CHEMBL51648
TypeSmall organic molecule
Emp. Form.C19H17F6NO2
Mol. Mass.405.3342
SMILESFC(F)(F)c1cc(CO[C@H]2OCCN[C@H]2c2ccccc2)cc(c1)C(F)(F)F