Reaction Details
TargetSubstance-P receptor
LigandBDBM50049469
Substrate/Competitorn/a
Meas. Tech.ChEMBL_205722 (CHEMBL807968)
IC50 0.09±n/a nM
Citation Hale, JJMills, SGMacCoss, MShah, SKQi, HMathre, DJCascieri, MASadowski, SStrader, CDMacIntyre, DEMetzger, JM 2(S)-((3,5-bis(trifluoromethyl)benzyl)-oxy)-3(S)-phenyl-4- ((3-oxo-1,2,4-triazol-5-yl)methyl)morpholine (1): a potent, orally active, morpholine-based human neurokinin-1 receptor antagonist. J Med Chem39:1760-2 (1996) 
 
Substance-P receptor
Name:Substance-P receptor
Type:G Protein-Coupled Receptor (GPCR)
Mol. Mass.:46254.43
Organism:Homo sapiens (Human)
Description:P25103
Residue:407
BDBM50049469
NameBDBM50049469
Synonyms:5-(((2S,3S)-2-(3,5-bis(trifluoromethyl)benzyloxy)-3-phenylmorpholino)methyl)-2H-1,2,4-triazol-3(4H)-one CHEMBL52330
TypeSmall organic molecule
Emp. Form.C22H20F6N4O3
Mol. Mass.502.4096
SMILESFC(F)(F)c1cc(CO[C@H]2OCCN(Cc3n[nH]c(=O)[nH]3)[C@H]2c2ccccc2)cc(c1)C(F)(F)F