Reaction Details
TargetSubstance-K receptor
LigandBDBM50049469
Substrate/Competitorn/a
Meas. Tech.ChEMBL_209020 (CHEMBL816315)
IC50 7±n/a nM
Citation Hale, JJMills, SGMacCoss, MShah, SKQi, HMathre, DJCascieri, MASadowski, SStrader, CDMacIntyre, DEMetzger, JM 2(S)-((3,5-bis(trifluoromethyl)benzyl)-oxy)-3(S)-phenyl-4- ((3-oxo-1,2,4-triazol-5-yl)methyl)morpholine (1): a potent, orally active, morpholine-based human neurokinin-1 receptor antagonist. J Med Chem39:1760-2 (1996) 
 
Substance-K receptor
Name:Substance-K receptor
Type:Protein
Mol. Mass.:44455.78
Organism:Homo sapiens (Human)
Description:P21452
Residue:398
BDBM50049469
NameBDBM50049469
Synonyms:5-(((2S,3S)-2-(3,5-bis(trifluoromethyl)benzyloxy)-3-phenylmorpholino)methyl)-2H-1,2,4-triazol-3(4H)-one CHEMBL52330
TypeSmall organic molecule
Emp. Form.C22H20F6N4O3
Mol. Mass.502.4096
SMILESFC(F)(F)c1cc(CO[C@H]2OCCN(Cc3n[nH]c(=O)[nH]3)[C@H]2c2ccccc2)cc(c1)C(F)(F)F