Reaction Details
TargetDihydrofolate reductase
LigandBDBM50049601
Substrate/Competitorn/a
Meas. Tech.ChEMBL_55116 (CHEMBL884367)
IC50 18±n/a nM
Citation Gangjee, AZhu, YQueener, SFFrancom, PBroom, AD Nonclassical 2,4-diamino-8-deazafolate analogues as inhibitors of dihydrofolate reductases from rat liver, Pneumocystis carinii, and Toxoplasma gondii. J Med Chem39:1836-45 (1996) 
 
Dihydrofolate reductase
Name:Dihydrofolate reductase
Type:Enzyme
Mol. Mass.:21638.84
Organism:Rattus norvegicus (rat)
Description:n/a
Residue:187
BDBM50049601
NameBDBM50049601
Synonyms:6-{[(4-Methoxy-phenyl)-methyl-amino]-methyl}-pyrido[3,2-d]pyrimidine-2,4-diamine | CHEMBL415962
TypeSmall organic molecule
Emp. Form.C16H18N6O
Mol. Mass.310.3537
SMILESCOc1ccc(cc1)N(C)Cc1ccc2nc(N)nc(N)c2n1