Reaction Details
TargetBifunctional dihydrofolate reductase-thymidylate synthase
LigandBDBM18268
Substrate/Competitorn/a
Meas. Tech.ChEMBL_53319 (CHEMBL665702)
IC50 10±n/a nM
Citation Gangjee, AZhu, YQueener, SFFrancom, PBroom, AD Nonclassical 2,4-diamino-8-deazafolate analogues as inhibitors of dihydrofolate reductases from rat liver, Pneumocystis carinii, and Toxoplasma gondii. J Med Chem39:1836-45 (1996) 
 
Bifunctional dihydrofolate reductase-thymidylate synthase
Name:Bifunctional dihydrofolate reductase-thymidylate synthase
Type:Enzyme
Mol. Mass.:68757.49
Organism:Toxoplasma gondii
Description:Q07422
Residue:610
BDBM18268
NameBDBM18268
Synonyms:5-methyl-6-{[(3,4,5-trimethoxyphenyl)amino]methyl}quinazoline-2,4-diamine TMQ US11111252, Compound TMQ | US11530198, Example Trimetrexate
TypeSmall organic molecule
Emp. Form.C19H23N5O3
Mol. Mass.369.4176
SMILESCOc1cc(NCc2ccc3nc(N)nc(N)c3c2C)cc(OC)c1OC