Reaction Details
TargetBifunctional dihydrofolate reductase-thymidylate synthase
LigandBDBM50049601
Substrate/Competitorn/a
Meas. Tech.ChEMBL_53319 (CHEMBL665702)
IC50 16±n/a nM
Citation Gangjee, AZhu, YQueener, SFFrancom, PBroom, AD Nonclassical 2,4-diamino-8-deazafolate analogues as inhibitors of dihydrofolate reductases from rat liver, Pneumocystis carinii, and Toxoplasma gondii. J Med Chem39:1836-45 (1996) 
 
Bifunctional dihydrofolate reductase-thymidylate synthase
Name:Bifunctional dihydrofolate reductase-thymidylate synthase
Type:Enzyme
Mol. Mass.:68757.49
Organism:Toxoplasma gondii
Description:Q07422
Residue:610
BDBM50049601
NameBDBM50049601
Synonyms:6-{[(4-Methoxy-phenyl)-methyl-amino]-methyl}-pyrido[3,2-d]pyrimidine-2,4-diamine | CHEMBL415962
TypeSmall organic molecule
Emp. Form.C16H18N6O
Mol. Mass.310.3537
SMILESCOc1ccc(cc1)N(C)Cc1ccc2nc(N)nc(N)c2n1