Reaction Details
TargetBifunctional dihydrofolate reductase-thymidylate synthase
LigandBDBM50049603
Substrate/Competitorn/a
Meas. Tech.ChEMBL_53319 (CHEMBL665702)
IC50 14±n/a nM
Citation Gangjee, AZhu, YQueener, SFFrancom, PBroom, AD Nonclassical 2,4-diamino-8-deazafolate analogues as inhibitors of dihydrofolate reductases from rat liver, Pneumocystis carinii, and Toxoplasma gondii. J Med Chem39:1836-45 (1996) 
 
Bifunctional dihydrofolate reductase-thymidylate synthase
Name:Bifunctional dihydrofolate reductase-thymidylate synthase
Type:Enzyme
Mol. Mass.:68757.49
Organism:Toxoplasma gondii
Description:Q07422
Residue:610
BDBM50049603
NameBDBM50049603
Synonyms:6-{[(2,4-Dimethoxy-phenyl)-methyl-amino]-methyl}-pyrido[3,2-d]pyrimidine-2,4-diamine | CHEMBL299174
TypeSmall organic molecule
Emp. Form.C17H20N6O2
Mol. Mass.340.3797
SMILESCOc1ccc(N(C)Cc2ccc3nc(N)nc(N)c3n2)c(OC)c1