Reaction Details
TargetGamma-aminobutyric acid receptor subunit alpha-6/beta-2/gamma-2
LigandBDBM50044947
Substrate/Competitorn/a
Meas. Tech.ChEMBL_69810 (CHEMBL677845)
Ki 9.4±n/a nM
Citation Liu, RHu, RJZhang, PSkolnick, PCook, JM Synthesis and pharmacological properties of novel 8-substituted imidazobenzodiazepines: high-affinity, selective probes for alpha 5-containing GABAA receptors. J Med Chem39:1928-34 (1996) 
 
Gamma-aminobutyric acid receptor subunit alpha-6/beta-2/gamma-2
Name:Gamma-aminobutyric acid receptor subunit alpha-6/beta-2/gamma-2
Type:n/a
Mol. Mass.:n/a
Description:ASSAY_ID of EBI is 30108
Components:This complex has 3 components.
Component 1
Name:Gamma-aminobutyric acid receptor subunit gamma-2
Synonyms:GABA(A) receptor subunit gamma-2 GBRG2_HUMAN
Type:PROTEIN
Mol. Mass.:54172.74
Organism:Homo sapiens (Human)
Description:EBI_217
Residue:467
Component 2
Name:Gamma-aminobutyric acid receptor subunit beta-2
Synonyms:GABA(A) receptor subunit beta-2 GBRB2_HUMAN
Type:PROTEIN
Mol. Mass.:59167.91
Organism:Homo sapiens (Human)
Description:EBI_221
Residue:512
Component 3
Name:Gamma-aminobutyric acid receptor subunit alpha-6
Synonyms:GABA A alpha6 GABRA6 | GBRA6_HUMAN
Type:Enzyme Catalytic Domain
Mol. Mass.:51029.60
Organism:Homo sapiens (Human)
Description:GABA A alpha6 0 HUMAN::Q16445
Residue:453
Component 4
Name:Gamma-aminobutyric acid receptor subunit beta-2
Synonyms:GABA(A) receptor subunit beta-2 GBRB2_HUMAN
Type:PROTEIN
Mol. Mass.:59167.91
Organism:Homo sapiens (Human)
Description:EBI_221
Residue:512
BDBM50044947
NameBDBM50044947
Synonyms:8-Bromo-5-methyl-6-oxo-5,6-dihydro-4H-2,5,10b-triaza-benzo[e]azulene-3-carboxylic acid tert-butyl ester | CHEMBL6655
TypeSmall organic molecule
Emp. Form.C17H18BrN3O3
Mol. Mass.392.247
SMILESCN1Cc2c(ncn2-c2ccc(Br)cc2C1=O)C(=O)OC(C)(C)C