Reaction Details
TargetNeuropeptide Y receptor type 1
LigandBDBM50049742
Substrate/Competitorn/a
Meas. Tech.ChEMBL_143828 (CHEMBL748713)
Ki 44±n/a nM
Citation Balasubramaniam, AZhai, WSheriff, STao, ZChance, WTFischer, JEEden, PTaylor, J Bis(31/31') ([CYS(31), Trp(32), Nva(34)] NPY-(31-36)): a specific NPY Y-1 receptor antagonist. J Med Chem39:811-3 (1996) 
 
Neuropeptide Y receptor type 1
Name:Neuropeptide Y receptor type 1
Type:Enzyme Catalytic Domain
Mol. Mass.:44399.07
Organism:Homo sapiens (Human)
Description:NPY-Y1 NPY1R HUMAN::P25929
Residue:384
BDBM50049742
NameBDBM50049742
Synonyms:CHEMBL265426 | NPY-analogs
TypeSmall organic molecule
Emp. Form.C130H192N38O26S2
Mol. Mass.2767.284
SMILESCCC[C@H](NC(=O)[C@H](CCCNC(N)=N)NC(=O)[C@H](Cc1c[nH]c2ccccc12)NC(=O)[C@H](CSSC[C@H](NC(=O)[C@H](CC(C)C)NC(=O)[C@H](CC(N)=O)NC(=O)[C@@H](NC(=O)[C@@H](N)Cc1ccc(O)cc1)[C@@H](C)CC)C(=O)N[C@@H](Cc1c[nH]c2ccccc12)C(=O)N[C@@H](CCCNC(N)=N)C(=O)N[C@@H](CCC)C(=O)N[C@@H](CCCNC(N)=N)C(=O)N[C@@H](Cc1ccc(O)cc1)C(N)=O)NC(=O)[C@H](CC(C)C)NC(=O)[C@H](CC(N)=O)NC(=O)[C@@H](NC(=O)[C@@H](N)Cc1ccc(O)cc1)[C@@H](C)CC)C(=O)N[C@@H](CCCNC(N)=N)C(=O)N[C@@H](Cc1ccc(O)cc1)C(N)=O