Reaction Details
TargetKappa-type opioid receptor
LigandBDBM50049809
Substrate/Competitorn/a
Meas. Tech.ChEMBL_146367 (CHEMBL759287)
Ki 18±n/a nM
Citation Cappelli, AAnzini, MVomero, SMenziani, MCDe Benedetti, PGSbacchi, MClarke, GDMennuni, L Synthesis, biological evaluation, and quantitative receptor docking simulations of 2-[(acylamino)ethyl]-1,4-benzodiazepines as novel tifluadom-like ligands with high affinity and selectivity for kappa-opioid receptors. J Med Chem39:860-72 (1996) 
 
Kappa-type opioid receptor
Name:Kappa-type opioid receptor
Type:G Protein-Coupled Receptor (GPCR)
Mol. Mass.:42744.99
Organism:Cavia porcellus (domestic guinea pig)
Description:P41144
Residue:380
BDBM50049809
NameBDBM50049809
Synonyms:CHEMBL126282 | N-[2-(7-Chloro-1-methyl-5-phenyl-2,3-dihydro-1H-benzo[e][1,4]diazepin-2-yl)-ethyl]-2-fluoro-benzamide
TypeSmall organic molecule
Emp. Form.C25H23ClFN3O
Mol. Mass.435.921
SMILESCN1C(CCNC(=O)c2ccccc2F)CN=C(c2ccccc2)c2cc(Cl)ccc12