Reaction Details
TargetDelta-type opioid receptor
LigandBDBM50049805
Substrate/Competitorn/a
Meas. Tech.ChEMBL_147020 (CHEMBL756222)
Ki 153±n/a nM
Citation Cappelli, AAnzini, MVomero, SMenziani, MCDe Benedetti, PGSbacchi, MClarke, GDMennuni, L Synthesis, biological evaluation, and quantitative receptor docking simulations of 2-[(acylamino)ethyl]-1,4-benzodiazepines as novel tifluadom-like ligands with high affinity and selectivity for kappa-opioid receptors. J Med Chem39:860-72 (1996) 
 
Delta-type opioid receptor
Name:Delta-type opioid receptor
Type:G Protein-Coupled Receptor (GPCR)
Mol. Mass.:40382.98
Organism:Homo sapiens (Human)
Description:Competition binding assays were carried out using membrane preparations from transfected HN9.10 cells that constitutively expressed the delta opioid receptor.
Residue:372
BDBM50049805
NameBDBM50049805
Synonyms:CHEMBL169703 Tifluadom
TypeSmall organic molecule
Emp. Form.C22H20FN3OS
Mol. Mass.393.477
SMILESCN1C(CNC(=O)c2ccsc2)CN=C(c2ccccc2F)c2ccccc12