Reaction Details
TargetDelta-type opioid receptor
LigandBDBM50049804
Substrate/Competitorn/a
Meas. Tech.ChEMBL_147023 (CHEMBL753664)
Ki>1000±n/a nM
Citation Cappelli, AAnzini, MVomero, SMenziani, MCDe Benedetti, PGSbacchi, MClarke, GDMennuni, L Synthesis, biological evaluation, and quantitative receptor docking simulations of 2-[(acylamino)ethyl]-1,4-benzodiazepines as novel tifluadom-like ligands with high affinity and selectivity for kappa-opioid receptors. J Med Chem39:860-72 (1996) 
 
Delta-type opioid receptor
Name:Delta-type opioid receptor
Type:G Protein-Coupled Receptor (GPCR)
Mol. Mass.:40382.98
Organism:Homo sapiens (Human)
Description:Competition binding assays were carried out using membrane preparations from transfected HN9.10 cells that constitutively expressed the delta opioid receptor.
Residue:372
BDBM50049804
NameBDBM50049804
Synonyms:1H-Indole-2-carboxylic acid [2-(7-chloro-1-methyl-5-phenyl-2,3-dihydro-1H-benzo[e][1,4]diazepin-2-yl)-ethyl]-amide | CHEMBL127619
TypeSmall organic molecule
Emp. Form.C27H25ClN4O
Mol. Mass.456.967
SMILESCN1C(CCNC(=O)c2cc3ccccc3[nH]2)CN=C(c2ccccc2)c2cc(Cl)ccc12