Reaction Details
TargetGastrin/cholecystokinin type B receptor
LigandBDBM50049806
Substrate/Competitorn/a
Meas. Tech.ChEMBL_48098 (CHEMBL663085)
Ki 13000±n/a nM
Citation Cappelli, AAnzini, MVomero, SMenziani, MCDe Benedetti, PGSbacchi, MClarke, GDMennuni, L Synthesis, biological evaluation, and quantitative receptor docking simulations of 2-[(acylamino)ethyl]-1,4-benzodiazepines as novel tifluadom-like ligands with high affinity and selectivity for kappa-opioid receptors. J Med Chem39:860-72 (1996) 
 
Gastrin/cholecystokinin type B receptor
Name:Gastrin/cholecystokinin type B receptor
Type:G Protein-Coupled Receptor (GPCR)
Mol. Mass.:48445.79
Organism:Homo sapiens (Human)
Description:Stable expression of human CCK-2 receptors in HEK 293 cells.
Residue:447
BDBM50049806
NameBDBM50049806
Synonyms:CHEMBL127969 | Thiophene-2-carboxylic acid [2-(1-methyl-5-phenyl-2,3-dihydro-1H-benzo[e][1,4]diazepin-2-yl)-ethyl]-amide
TypeSmall organic molecule
Emp. Form.C23H23N3OS
Mol. Mass.389.513
SMILESCN1C(CCNC(=O)c2cccs2)CN=C(c2ccccc2)c2ccccc12