Reaction Details
TargetDihydrofolate reductase
LigandBDBM50049900
Substrate/Competitorn/a
Meas. Tech.ChEMBL_54280 (CHEMBL669873)
Ki 230±n/a nM
Citation Kuyper, LFBaccanari, DPJones, MLHunter, RNTansik, RLJoyner, SSBoytos, CMRudolph, SKKnick, VWilson, HRCaddell, JMFriedman, HSComley, JCStables, JN High-affinity inhibitors of dihydrofolate reductase: antimicrobial and anticancer activities of 7,8-dialkyl-1,3-diaminopyrrolo[3,2-f]quinazolines with small molecular size. J Med Chem39:892-903 (1996) 
 
Dihydrofolate reductase
Name:Dihydrofolate reductase
Type:Enzyme
Mol. Mass.:21453.99
Organism:Homo sapiens (Human)
Description:Recombinant human DHFR.
Residue:187
BDBM50049900
NameBDBM50049900
Synonyms:7-Methyl-7H-pyrrolo[3,2-f]quinazoline-1,3-diamine TCMDC-139863
TypeSmall organic molecule
Emp. Form.C11H11N5
Mol. Mass.213.2385
SMILESCn1ccc2c1ccc1nc(N)nc(N)c21