Reaction Details
TargetDihydrofolate reductase
LigandBDBM50049912
Substrate/Competitorn/a
Meas. Tech.ChEMBL_54223 (CHEMBL668101)
Ki 0.0071±n/a nM
Citation Kuyper, LFBaccanari, DPJones, MLHunter, RNTansik, RLJoyner, SSBoytos, CMRudolph, SKKnick, VWilson, HRCaddell, JMFriedman, HSComley, JCStables, JN High-affinity inhibitors of dihydrofolate reductase: antimicrobial and anticancer activities of 7,8-dialkyl-1,3-diaminopyrrolo[3,2-f]quinazolines with small molecular size. J Med Chem39:892-903 (1996) 
 
Dihydrofolate reductase
Name:Dihydrofolate reductase
Type:Enzyme
Mol. Mass.:22141.77
Organism:Candida albicans
Description:C. albicans DHFR was expressed in E. coli BL21, and purified to homogeneity.
Residue:192
BDBM50049912
NameBDBM50049912
Synonyms:7-(1,1-Dimethyl-propyl)-8-methyl-7H-pyrrolo[3,2-f]quinazoline-1,3-diamine TCMDC-137307
TypeSmall organic molecule
Emp. Form.C16H21N5
Mol. Mass.283.3714
SMILESCCC(C)(C)n1c(C)cc2c1ccc1nc(N)nc(N)c21