Reaction Details
TargetDihydrofolate reductase
LigandBDBM50049907
Substrate/Competitorn/a
Meas. Tech.ChEMBL_54280 (CHEMBL669873)
Ki 0.1±n/a nM
Citation Kuyper, LFBaccanari, DPJones, MLHunter, RNTansik, RLJoyner, SSBoytos, CMRudolph, SKKnick, VWilson, HRCaddell, JMFriedman, HSComley, JCStables, JN High-affinity inhibitors of dihydrofolate reductase: antimicrobial and anticancer activities of 7,8-dialkyl-1,3-diaminopyrrolo[3,2-f]quinazolines with small molecular size. J Med Chem39:892-903 (1996) 
 
Dihydrofolate reductase
Name:Dihydrofolate reductase
Type:Enzyme
Mol. Mass.:21453.99
Organism:Homo sapiens (Human)
Description:Recombinant human DHFR.
Residue:187
BDBM50049907
NameBDBM50049907
Synonyms:7-(1-Ethyl-propyl)-8-isopropyl-7H-pyrrolo[3,2-f]quinazoline-1,3-diamine | CHEMBL171765
TypeSmall organic molecule
Emp. Form.C18H25N5
Mol. Mass.311.4246
SMILESCCC(CC)n1c(cc2c1ccc1nc(N)nc(N)c21)C(C)C