Reaction Details
TargetDihydrofolate reductase
LigandBDBM50049914
Substrate/Competitorn/a
Meas. Tech.ChEMBL_54223 (CHEMBL668101)
Ki 0.23±n/a nM
Citation Kuyper, LFBaccanari, DPJones, MLHunter, RNTansik, RLJoyner, SSBoytos, CMRudolph, SKKnick, VWilson, HRCaddell, JMFriedman, HSComley, JCStables, JN High-affinity inhibitors of dihydrofolate reductase: antimicrobial and anticancer activities of 7,8-dialkyl-1,3-diaminopyrrolo[3,2-f]quinazolines with small molecular size. J Med Chem39:892-903 (1996) 
 
Dihydrofolate reductase
Name:Dihydrofolate reductase
Type:Enzyme
Mol. Mass.:22141.77
Organism:Candida albicans
Description:C. albicans DHFR was expressed in E. coli BL21, and purified to homogeneity.
Residue:192
BDBM50049914
NameBDBM50049914
Synonyms:7-(3,4,5-Trimethoxy-benzyl)-7H-pyrrolo[3,2-f]quinazoline-1,3-diamine TCMDC-137341
TypeSmall organic molecule
Emp. Form.C20H21N5O3
Mol. Mass.379.4124
SMILESCOc1cc(Cn2ccc3c2ccc2nc(N)nc(N)c32)cc(OC)c1OC