Reaction Details
TargetEndothelin-1 receptor
LigandBDBM50050043
Substrate/Competitorn/a
Meas. Tech.ChEMBL_63356 (CHEMBL679120)
IC50 7.6±n/a nM
Citation von Geldern, TWKester, JABal, RWu-Wong, JRChiou, WDixon, DBOpgenorth, TJ Azole endothelin antagonists. 2. Structure-activity studies. J Med Chem39:968-81 (1996) 
 
Endothelin-1 receptor
Name:Endothelin-1 receptor
Type:Enzyme Catalytic Domain
Mol. Mass.:48256.91
Organism:RAT
Description:ENDOTHELIN A EDNRA RAT::P26684
Residue:426
BDBM50050043
NameBDBM50050043
Synonyms:5-Methyl-2-{(R)-2-(1-methyl-1H-indol-3-yl)-1-[(S)-4-methyl-2-(3-phenyl-ureido)-pentanoylamino]-ethyl}-1H-imidazole-4-carboxylic acid | CHEMBL367208
TypeSmall organic molecule
Emp. Form.C29H34N6O4
Mol. Mass.530.6181
SMILESCC(C)C[C@H](NC(=O)Nc1ccccc1)C(=O)N[C@H](Cc1cn(C)c2ccccc12)c1nc(C(O)=O)c(C)[nH]1