Reaction Details
TargetEndothelin-1 receptor
LigandBDBM50050001
Substrate/Competitorn/a
Meas. Tech.ChEMBL_63356 (CHEMBL679120)
IC50 18±n/a nM
Citation von Geldern, TWKester, JABal, RWu-Wong, JRChiou, WDixon, DBOpgenorth, TJ Azole endothelin antagonists. 2. Structure-activity studies. J Med Chem39:968-81 (1996) 
 
Endothelin-1 receptor
Name:Endothelin-1 receptor
Type:Enzyme Catalytic Domain
Mol. Mass.:48256.91
Organism:RAT
Description:ENDOTHELIN A EDNRA RAT::P26684
Residue:426
BDBM50050001
NameBDBM50050001
Synonyms:5-Methyl-2-((R)-2-(1-methyl-1H-indol-3-yl)-1-{(S)-4-methyl-2-[3-(2-methyl-cyclohexyl)-ureido]-pentanoylamino}-ethyl)-1H-imidazole-4-carboxylic acid | CHEMBL366544
TypeSmall organic molecule
Emp. Form.C30H42N6O4
Mol. Mass.550.6923
SMILESCC(C)C[C@H](NC(=O)NC1CCCCC1C)C(=O)N[C@H](Cc1cn(C)c2ccccc12)c1nc(C(O)=O)c(C)[nH]1