Reaction Details
TargetHistamine H3 receptor
LigandBDBM22916
Substrate/Competitorn/a
Meas. Tech.ChEMBL_83829 (CHEMBL692770)
Ki 5±n/a nM
Citation Stark, HPurand, KHüls, ALigneau, XGarbarg, MSchwartz, JCSchunack, W [125I]iodoproxyfan and related compounds: a reversible radioligand and novel classes of antagonists with high affinity and selectivity for the histamine H3 receptor. J Med Chem39:1220-6 (1996) 
 
Histamine H3 receptor
Name:Histamine H3 receptor
Type:G Protein-Coupled Receptor (GPCR)
Mol. Mass.:48607.98
Organism:Rattus norvegicus (rat)
Description:n/a
Residue:445
BDBM22916
NameBDBM22916
Synonyms:5-{3-[(4-iodophenyl)methoxy]propyl}-1H-imidazole Iodoproxyfan
TypeSmall organic molecule
Emp. Form.C13H15IN2O
Mol. Mass.342.1755
SMILESIc1ccc(COCCCc2cnc[nH]2)cc1