Reaction Details
TargetHistamine H3 receptor
LigandBDBM50050181
Substrate/Competitorn/a
Meas. Tech.ChEMBL_83825 (CHEMBL691842)
Ki 3.2±n/a nM
Citation Stark, HPurand, KHüls, ALigneau, XGarbarg, MSchwartz, JCSchunack, W [125I]iodoproxyfan and related compounds: a reversible radioligand and novel classes of antagonists with high affinity and selectivity for the histamine H3 receptor. J Med Chem39:1220-6 (1996) 
 
Histamine H3 receptor
Name:Histamine H3 receptor
Type:G Protein-Coupled Receptor (GPCR)
Mol. Mass.:48607.98
Organism:Rattus norvegicus (rat)
Description:n/a
Residue:445
BDBM50050181
NameBDBM50050181
Synonyms:4-[3-(4-Iodo-phenoxy)-propyl]-1H-imidazole | CHEMBL21230
TypeSmall organic molecule
Emp. Form.C12H13IN2O
Mol. Mass.328.1489
SMILESIc1ccc(OCCCc2cnc[nH]2)cc1