Reaction Details
TargetD(4) dopamine receptor
LigandBDBM50050474
Substrate/Competitorn/a
Meas. Tech.ChEMBL_63104 (CHEMBL674497)
Ki 1.2±n/a nM
Citation Rowley, MBroughton, HBCollins, IBaker, REmms, FMarwood, RPatel, SPatel, SRagan, CIFreedman, SBLeeson, PD 5-(4-Chlorophenyl)-4-methyl-3-(1-(2-phenylethyl)piperidin-4-yl)isoxazole: a potent, selective antagonist at human cloned dopamine D4 receptors. J Med Chem39:1943-5 (1996) 
 
D(4) dopamine receptor
Name:D(4) dopamine receptor
Type:Enzyme
Mol. Mass.:48373.19
Organism:Homo sapiens (Human)
Description:P21917
Residue:419
BDBM50050474
NameBDBM50050474
Synonyms:4-[5-(4-Chloro-phenyl)-4-methyl-1H-pyrazol-3-yl]-1-phenethyl-piperidine | CHEMBL61079
TypeSmall organic molecule
Emp. Form.C23H26ClN3
Mol. Mass.379.926
SMILESCc1c([nH]nc1-c1ccc(Cl)cc1)C1CCN(CCc2ccccc2)CC1