Reaction Details
TargetcGMP-specific 3',5'-cyclic phosphodiesterase
LigandBDBM50050622
Substrate/Competitorn/a
Meas. Tech.ChEMBL_155200 (CHEMBL763673)
IC50 2±n/a nM
Citation Dumaître, BDodic, N Synthesis and cyclic GMP phosphodiesterase inhibitory activity of a series of 6-phenylpyrazolo[3,4-d]pyrimidones. J Med Chem39:1635-44 (1996) 
 
cGMP-specific 3',5'-cyclic phosphodiesterase
Name:cGMP-specific 3',5'-cyclic phosphodiesterase
Type:Protein
Mol. Mass.:99975.83
Organism:Homo sapiens (Human)
Description:O76074
Residue:875
BDBM50050622
NameBDBM50050622
Synonyms:1-Ethyl-3-methyl-6-(2-propoxy-phenyl)-1,5-dihydro-pyrazolo[3,4-d]pyrimidin-4-one | CHEMBL46714
TypeSmall organic molecule
Emp. Form.C17H20N4O2
Mol. Mass.312.3663
SMILESCCCOc1ccccc1-c1nc2n(CC)nc(C)c2c(=O)[nH]1