Reaction Details
TargetcGMP-specific 3',5'-cyclic phosphodiesterase
LigandBDBM50050577
Substrate/Competitorn/a
Meas. Tech.ChEMBL_155200 (CHEMBL763673)
IC50 2±n/a nM
Citation Dumaître, BDodic, N Synthesis and cyclic GMP phosphodiesterase inhibitory activity of a series of 6-phenylpyrazolo[3,4-d]pyrimidones. J Med Chem39:1635-44 (1996) 
 
cGMP-specific 3',5'-cyclic phosphodiesterase
Name:cGMP-specific 3',5'-cyclic phosphodiesterase
Type:Protein
Mol. Mass.:99975.83
Organism:Homo sapiens (Human)
Description:O76074
Residue:875
BDBM50050577
NameBDBM50050577
Synonyms:1-Ethyl-3-methyl-6-[2-propoxy-5-(2-pyridin-3-yl-thiazol-4-yl)-phenyl]-1,5-dihydro-pyrazolo[3,4-d]pyrimidin-4-one | CHEMBL295329
TypeSmall organic molecule
Emp. Form.C25H24N6O2S
Mol. Mass.472.562
SMILESCCCOc1ccc(cc1-c1nc2n(CC)nc(C)c2c(=O)[nH]1)-c1csc(n1)-c1cccnc1