Reaction Details
TargetcGMP-specific 3',5'-cyclic phosphodiesterase
LigandBDBM50050618
Substrate/Competitorn/a
Meas. Tech.ChEMBL_155200 (CHEMBL763673)
IC50 2±n/a nM
Citation Dumaître, BDodic, N Synthesis and cyclic GMP phosphodiesterase inhibitory activity of a series of 6-phenylpyrazolo[3,4-d]pyrimidones. J Med Chem39:1635-44 (1996) 
 
cGMP-specific 3',5'-cyclic phosphodiesterase
Name:cGMP-specific 3',5'-cyclic phosphodiesterase
Type:Protein
Mol. Mass.:99975.83
Organism:Homo sapiens (Human)
Description:O76074
Residue:875
BDBM50050618
NameBDBM50050618
Synonyms:CHEMBL291178 | [3-(1,3-Dimethyl-4-oxo-4,5-dihydro-1H-pyrazolo[3,4-d]pyrimidin-6-yl)-4-propoxy-phenyl]-carbamic acid methyl ester
TypeSmall organic molecule
Emp. Form.C18H21N5O4
Mol. Mass.371.3904
SMILESCCCOc1ccc(NC(=O)OC)cc1-c1nc2n(C)nc(C)c2c(=O)[nH]1