Reaction Details
TargetcGMP-specific 3',5'-cyclic phosphodiesterase
LigandBDBM50050599
Substrate/Competitorn/a
Meas. Tech.ChEMBL_155200 (CHEMBL763673)
IC50 4±n/a nM
Citation Dumaître, BDodic, N Synthesis and cyclic GMP phosphodiesterase inhibitory activity of a series of 6-phenylpyrazolo[3,4-d]pyrimidones. J Med Chem39:1635-44 (1996) 
 
cGMP-specific 3',5'-cyclic phosphodiesterase
Name:cGMP-specific 3',5'-cyclic phosphodiesterase
Type:Protein
Mol. Mass.:99975.83
Organism:Homo sapiens (Human)
Description:O76074
Residue:875
BDBM50050599
NameBDBM50050599
Synonyms:1,3-Dimethyl-6-[5-(5-methyl-thiophen-2-yl)-2-propoxy-phenyl]-1,5-dihydro-pyrazolo[3,4-d]pyrimidin-4-one | CHEMBL298282
TypeSmall organic molecule
Emp. Form.C21H22N4O2S
Mol. Mass.394.49
SMILESCCCOc1ccc(cc1-c1nc2n(C)nc(C)c2c(=O)[nH]1)-c1ccc(C)s1