Reaction Details
TargetcGMP-specific 3',5'-cyclic phosphodiesterase
LigandBDBM50050626
Substrate/Competitorn/a
Meas. Tech.ChEMBL_155200 (CHEMBL763673)
IC50 1.7±n/a nM
Citation Dumaître, BDodic, N Synthesis and cyclic GMP phosphodiesterase inhibitory activity of a series of 6-phenylpyrazolo[3,4-d]pyrimidones. J Med Chem39:1635-44 (1996) 
 
cGMP-specific 3',5'-cyclic phosphodiesterase
Name:cGMP-specific 3',5'-cyclic phosphodiesterase
Type:Protein
Mol. Mass.:99975.83
Organism:Homo sapiens (Human)
Description:O76074
Residue:875
BDBM50050626
NameBDBM50050626
Synonyms:1-Ethyl-3-methyl-6-[5-(5-phenyl-1H-[1,2,4]triazol-3-yl)-2-propoxy-phenyl]-1,5-dihydro-pyrazolo[3,4-d]pyrimidin-4-one | CHEMBL296294
TypeSmall organic molecule
Emp. Form.C25H25N7O2
Mol. Mass.455.5117
SMILESCCCOc1ccc(cc1-c1nc2n(CC)nc(C)c2c(=O)[nH]1)-c1nnc([nH]1)-c1ccccc1