Reaction Details
TargetcGMP-specific 3',5'-cyclic phosphodiesterase
LigandBDBM50050627
Substrate/Competitorn/a
Meas. Tech.ChEMBL_155200 (CHEMBL763673)
IC50 1.5±n/a nM
Citation Dumaître, BDodic, N Synthesis and cyclic GMP phosphodiesterase inhibitory activity of a series of 6-phenylpyrazolo[3,4-d]pyrimidones. J Med Chem39:1635-44 (1996) 
 
cGMP-specific 3',5'-cyclic phosphodiesterase
Name:cGMP-specific 3',5'-cyclic phosphodiesterase
Type:Protein
Mol. Mass.:99975.83
Organism:Homo sapiens (Human)
Description:O76074
Residue:875
BDBM50050627
NameBDBM50050627
Synonyms:CHEMBL298478 | Thiophene-2-carboxylic acid [3-(1,3-dimethyl-4-oxo-4,5-dihydro-1H-pyrazolo[3,4-d]pyrimidin-6-yl)-4-propoxy-phenyl]-amide
TypeSmall organic molecule
Emp. Form.C21H21N5O3S
Mol. Mass.423.488
SMILESCCCOc1ccc(NC(=O)c2cccs2)cc1-c1nc2n(C)nc(C)c2c(=O)[nH]1