Reaction Details
TargetReverse transcriptase/RNaseH
LigandBDBM50050630
Substrate/Competitorn/a
Meas. Tech.ChEMBL_195513 (CHEMBL800581)
IC50 11500±n/a nM
Citation Gussio, RPattabiraman, NZaharevitz, DWKellogg, GETopol, IARice, WGSchaeffer, CAErickson, JWBurt, SK All-atom models for the non-nucleoside binding site of HIV-1 reverse transcriptase complexed with inhibitors: a 3D QSAR approach. J Med Chem39:1645-50 (1996) 
 
Reverse transcriptase/RNaseH
Name:Reverse transcriptase/RNaseH
Type:PROTEIN
Mol. Mass.:65229.15
Organism:Human immunodeficiency virus 1
Description:ChEMBL_1473730
Residue:566
BDBM50050630
NameBDBM50050630
Synonyms:8-Cyclopropyl-3-methyl-8H-1,2,3a,7,8,9-hexaaza-dibenzo[e,h]azulene | CHEMBL290204
TypeSmall organic molecule
Emp. Form.C16H14N6
Mol. Mass.290.3226
SMILESCc1nnc2-c3cccnc3N(C3CC3)c3ncccc3-n12