Reaction Details
TargetReverse transcriptase/RNaseH
LigandBDBM50050629
Substrate/Competitorn/a
Meas. Tech.ChEMBL_195513 (CHEMBL800581)
IC50 12200±n/a nM
Citation Gussio, RPattabiraman, NZaharevitz, DWKellogg, GETopol, IARice, WGSchaeffer, CAErickson, JWBurt, SK All-atom models for the non-nucleoside binding site of HIV-1 reverse transcriptase complexed with inhibitors: a 3D QSAR approach. J Med Chem39:1645-50 (1996) 
 
Reverse transcriptase/RNaseH
Name:Reverse transcriptase/RNaseH
Type:PROTEIN
Mol. Mass.:65229.15
Organism:Human immunodeficiency virus 1
Description:ChEMBL_1473730
Residue:566
BDBM50050629
NameBDBM50050629
Synonyms:8-Ethyl-3,4-dimethyl-7H,8H-1,3a,7,8,9-pentaaza-dibenzo[e,h]azulen-6-one | CHEMBL295930
TypeSmall organic molecule
Emp. Form.C17H17N5O
Mol. Mass.307.3498
SMILESCCN1c2ncccc2-c2ncc(C)n2-c2c(C)cc(=O)[nH]c12