Reaction Details
TargetEndothelin receptor type B
LigandBDBM50050789
Substrate/Competitorn/a
Meas. Tech.ChEMBL_63518 (CHEMBL877477)
Ki 160±n/a nM
Citation Riechers, HAlbrecht, HPAmberg, WBaumann, EBernard, HBöhm, HJKlinge, DKling, AMüller, SRaschack, MUnger, LWalker, NWernet, W Discovery and optimization of a novel class of orally active nonpeptidic endothelin-A receptor antagonists. J Med Chem39:2123-8 (1996) 
 
Endothelin receptor type B
Name:Endothelin receptor type B
Type:Enzyme Catalytic Domain
Mol. Mass.:49664.00
Organism:Homo sapiens (Human)
Description:ENDOTHELIN B EDNRB HUMAN::P24530
Residue:442
BDBM50050789
NameBDBM50050789
Synonyms:2-(4-Ethyl-6-methyl-pyrimidin-2-yloxy)-3-methoxy-3,3-diphenyl-propionic acid | CHEMBL305270
TypeSmall organic molecule
Emp. Form.C23H24N2O4
Mol. Mass.392.4477
SMILESCCc1cc(C)nc(OC(C(O)=O)C(OC)(c2ccccc2)c2ccccc2)n1