Reaction Details
TargetEndothelin receptor type B
LigandBDBM50050796
Substrate/Competitorn/a
Meas. Tech.ChEMBL_63518 (CHEMBL877477)
Ki 1100±n/a nM
Citation Riechers, HAlbrecht, HPAmberg, WBaumann, EBernard, HBöhm, HJKlinge, DKling, AMüller, SRaschack, MUnger, LWalker, NWernet, W Discovery and optimization of a novel class of orally active nonpeptidic endothelin-A receptor antagonists. J Med Chem39:2123-8 (1996) 
 
Endothelin receptor type B
Name:Endothelin receptor type B
Type:Enzyme Catalytic Domain
Mol. Mass.:49664.00
Organism:Homo sapiens (Human)
Description:ENDOTHELIN B EDNRB HUMAN::P24530
Residue:442
BDBM50050796
NameBDBM50050796
Synonyms:2-(4,6-Diethyl-pyrimidin-2-yloxy)-3-methoxy-3,3-diphenyl-propionic acid | CHEMBL418326
TypeSmall organic molecule
Emp. Form.C24H26N2O4
Mol. Mass.406.4742
SMILESCCc1cc(CC)nc(OC(C(O)=O)C(OC)(c2ccccc2)c2ccccc2)n1