Reaction Details
TargetEndothelin receptor type B
LigandBDBM50050802
Substrate/Competitorn/a
Meas. Tech.ChEMBL_63518 (CHEMBL877477)
Ki 2500±n/a nM
Citation Riechers, HAlbrecht, HPAmberg, WBaumann, EBernard, HBöhm, HJKlinge, DKling, AMüller, SRaschack, MUnger, LWalker, NWernet, W Discovery and optimization of a novel class of orally active nonpeptidic endothelin-A receptor antagonists. J Med Chem39:2123-8 (1996) 
 
Endothelin receptor type B
Name:Endothelin receptor type B
Type:Enzyme Catalytic Domain
Mol. Mass.:49664.00
Organism:Homo sapiens (Human)
Description:ENDOTHELIN B EDNRB HUMAN::P24530
Residue:442
BDBM50050802
NameBDBM50050802
Synonyms:2-(4,6-Dimethoxy-pyrimidin-2-yloxy)-3-ethoxy-3,3-diphenyl-propionic acid | CHEMBL304778
TypeSmall organic molecule
Emp. Form.C23H24N2O6
Mol. Mass.424.4465
SMILESCCOC(C(Oc1nc(OC)cc(OC)n1)C(O)=O)(c1ccccc1)c1ccccc1