Reaction Details
TargetEndothelin receptor type B
LigandBDBM50050800
Substrate/Competitorn/a
Meas. Tech.ChEMBL_63518 (CHEMBL877477)
Ki 57±n/a nM
Citation Riechers, HAlbrecht, HPAmberg, WBaumann, EBernard, HBöhm, HJKlinge, DKling, AMüller, SRaschack, MUnger, LWalker, NWernet, W Discovery and optimization of a novel class of orally active nonpeptidic endothelin-A receptor antagonists. J Med Chem39:2123-8 (1996) 
 
Endothelin receptor type B
Name:Endothelin receptor type B
Type:Enzyme Catalytic Domain
Mol. Mass.:49664.00
Organism:Homo sapiens (Human)
Description:ENDOTHELIN B EDNRB HUMAN::P24530
Residue:442
BDBM50050800
NameBDBM50050800
Synonyms:3-Methoxy-2-(4-methoxy-5,6-dihydro-furo[2,3-d]pyrimidin-2-yloxy)-3,3-diphenyl-propionic acid | CHEMBL305980
TypeSmall organic molecule
Emp. Form.C23H22N2O6
Mol. Mass.422.4306
SMILESCOc1nc(OC(C(O)=O)C(OC)(c2ccccc2)c2ccccc2)nc2OCCc12