Reaction Details
TargetRibonucleoside-diphosphate reductase large subunit
LigandBDBM50050819
Substrate/Competitorn/a
Meas. Tech.ChEMBL_195387 (CHEMBL806876)
IC50 670±n/a nM
Citation Moss, NBeaulieu, PDuceppe, JSFerland, JMGauthier, JGhiro, EGoulet, SGuse, ILlinàs-Brunet, MPlante, RPlamondon, LWernic, DDéziel, R Ureido-based peptidomimetic inhibitor of herpes simplex virus ribonucleotide reductase: an investigation of inhibitor bioactive conformation. J Med Chem39:2178-87 (1996) 
 
Ribonucleoside-diphosphate reductase large subunit
Name:Ribonucleoside-diphosphate reductase large subunit
Type:PROTEIN
Mol. Mass.:124049.68
Organism:Human herpesvirus 1 (strain 17) (HHV-1) (Human herpes simplex virus1)
Description:ChEMBL_195109
Residue:1137
BDBM50050819
NameBDBM50050819
Synonyms:(S)-2-[(S)-3-Carboxy-2-((S)-2-{2-[3-(1-ethyl-propyl)-ureido]-acetylamino}-4-oxo-4-pyrrolidin-1-yl-butyrylamino)-propionylamino]-4-methyl-pentanoic acid | CHEMBL305067
TypeSmall organic molecule
Emp. Form.C26H44N6O9
Mol. Mass.584.6624
SMILESCCC(CC)NC(=O)NCC(=O)N[C@@H](CC(=O)N1CCCC1)C(=O)N[C@@H](CC(O)=O)C(=O)N[C@@H](CC(C)C)C(O)=O