Reaction Details
TargetRibonucleoside-diphosphate reductase large subunit
LigandBDBM50050829
Substrate/Competitorn/a
Meas. Tech.ChEMBL_195387 (CHEMBL806876)
IC50 435±n/a nM
Citation Moss, NBeaulieu, PDuceppe, JSFerland, JMGauthier, JGhiro, EGoulet, SGuse, ILlinàs-Brunet, MPlante, RPlamondon, LWernic, DDéziel, R Ureido-based peptidomimetic inhibitor of herpes simplex virus ribonucleotide reductase: an investigation of inhibitor bioactive conformation. J Med Chem39:2178-87 (1996) 
 
Ribonucleoside-diphosphate reductase large subunit
Name:Ribonucleoside-diphosphate reductase large subunit
Type:PROTEIN
Mol. Mass.:124049.68
Organism:Human herpesvirus 1 (strain 17) (HHV-1) (Human herpes simplex virus1)
Description:ChEMBL_195109
Residue:1137
BDBM50050829
NameBDBM50050829
Synonyms:(S)-2-((S)-3-Carboxy-2-{(S)-2-[(S)-2-(3-isopropyl-ureido)-3-methyl-butyrylamino]-4-oxo-4-pyrrolidin-1-yl-butyrylamino}-propionylamino)-4-methyl-pentanoic acid | CHEMBL71721
TypeSmall organic molecule
Emp. Form.C27H46N6O9
Mol. Mass.598.6889
SMILESCC(C)C[C@H](NC(=O)[C@H](CC(O)=O)NC(=O)[C@H](CC(=O)N1CCCC1)NC(=O)[C@@H](NC(=O)NC(C)C)C(C)C)C(O)=O