Reaction Details
TargetfMet-Leu-Phe receptor
LigandBDBM50050937
Substrate/Competitorn/a
Meas. Tech.ChEMBL_216403 (CHEMBL820116)
IC50 20±n/a nM
Citation Higgins, JDBridger, GJDerian, CKBeblavy, MJHernandez, PEGaul, FEAbrams, MJPike, MCSolomon, HF N-terminus urea-substituted chemotactic peptides: new potent agonists and antagonists toward the neutrophil fMLF receptor. J Med Chem39:1013-5 (1996) 
 
fMet-Leu-Phe receptor
Name:fMet-Leu-Phe receptor
Type:Enzyme Catalytic Domain
Mol. Mass.:38456.14
Organism:Homo sapiens (Human)
Description:gi_4503779
Residue:350
BDBM50050937
NameBDBM50050937
Synonyms:(S)-2-[(S)-2-((S)-2-Formylamino-4-methylsulfanyl-butyrylamino)-4-methyl-pentanoylamino]-3-phenyl-propionic acid N-formyl-methionyl-leucyl-phenylalanine | N-formylmethionine-leucine-phenylalanine
TypeSmall organic molecule
Emp. Form.C21H31N3O5S
Mol. Mass.437.553
SMILESCSCC[C@H](NC=O)C(=O)N[C@@H](CC(C)C)C(=O)N[C@@H](Cc1ccccc1)C(O)=O