Reaction Details
TargetfMet-Leu-Phe receptor
LigandBDBM50050931
Substrate/Competitorn/a
Meas. Tech.ChEMBL_216403 (CHEMBL820116)
IC50 300±n/a nM
Citation Higgins, JDBridger, GJDerian, CKBeblavy, MJHernandez, PEGaul, FEAbrams, MJPike, MCSolomon, HF N-terminus urea-substituted chemotactic peptides: new potent agonists and antagonists toward the neutrophil fMLF receptor. J Med Chem39:1013-5 (1996) 
 
fMet-Leu-Phe receptor
Name:fMet-Leu-Phe receptor
Type:Enzyme Catalytic Domain
Mol. Mass.:38456.14
Organism:Homo sapiens (Human)
Description:gi_4503779
Residue:350
BDBM50050931
NameBDBM50050931
Synonyms:(S)-2-[(R)-2-((S)-2-{(R)-2-[(S)-2-(3-Butyl-ureido)-3-phenyl-propionylamino]-4-methyl-pentanoylamino}-3-phenyl-propionylamino)-4-methyl-pentanoylamino]-3-phenyl-propionic acid | CHEMBL7363
TypeSmall organic molecule
Emp. Form.C44H60N6O7
Mol. Mass.784.9832
SMILESCCCCNC(=O)N[C@@H](Cc1ccccc1)C(=O)N[C@H](CC(C)C)C(=O)N[C@@H](Cc1ccccc1)C(=O)N[C@H](CC(C)C)C(=O)N[C@@H](Cc1ccccc1)C(O)=O