Reaction Details
TargetEndothelin-1 receptor
LigandBDBM50051022
Substrate/Competitorn/a
Meas. Tech.ChEMBL_63357 (CHEMBL679121)
IC50 0.43±n/a nM
Citation Winn, Mvon Geldern, TWOpgenorth, TJJae, HSTasker, ASBoyd, SAKester, JAMantei, RABal, RSorensen, BKWu-Wong, JRChiou, WJDixon, DBNovosad, EIHernandez, LMarsh, KC 2,4-Diarylpyrrolidine-3-carboxylic acids--potent ETA selective endothelin receptor antagonists. 1. Discovery of A-127722. J Med Chem39:1039-48 (1996) 
 
Endothelin-1 receptor
Name:Endothelin-1 receptor
Type:Enzyme Catalytic Domain
Mol. Mass.:48256.91
Organism:RAT
Description:ENDOTHELIN A EDNRA RAT::P26684
Residue:426
BDBM50051022
NameBDBM50051022
Synonyms:(2S,3S,4R)-4-Benzo[1,3]dioxol-5-yl-1-{[bis-(3-methyl-butyl)-carbamoyl]-methyl}-2-(4-methoxy-phenyl)-pyrrolidine-3-carboxylic acid | CHEMBL269141
TypeSmall organic molecule
Emp. Form.C31H42N2O6
Mol. Mass.538.675
SMILESCOc1ccc(cc1)[C@@H]1[C@H]([C@@H](CN1CC(=O)N(CCC(C)C)CCC(C)C)c1ccc2OCOc2c1)C(O)=O