Reaction Details
TargetEndothelin-1 receptor
LigandBDBM50050983
Substrate/Competitorn/a
Meas. Tech.ChEMBL_63357 (CHEMBL679121)
IC50 34.2±n/a nM
Citation Winn, Mvon Geldern, TWOpgenorth, TJJae, HSTasker, ASBoyd, SAKester, JAMantei, RABal, RSorensen, BKWu-Wong, JRChiou, WJDixon, DBNovosad, EIHernandez, LMarsh, KC 2,4-Diarylpyrrolidine-3-carboxylic acids--potent ETA selective endothelin receptor antagonists. 1. Discovery of A-127722. J Med Chem39:1039-48 (1996) 
 
Endothelin-1 receptor
Name:Endothelin-1 receptor
Type:Enzyme Catalytic Domain
Mol. Mass.:48256.91
Organism:RAT
Description:ENDOTHELIN A EDNRA RAT::P26684
Residue:426
BDBM50050983
NameBDBM50050983
Synonyms:(2S,3S,4R)-1-Allylcarbamoylmethyl-4-benzo[1,3]dioxol-5-yl-2-(4-methoxy-phenyl)-pyrrolidine-3-carboxylic acid | CHEMBL9342
TypeSmall organic molecule
Emp. Form.C24H26N2O6
Mol. Mass.438.473
SMILESCOc1ccc(cc1)[C@@H]1[C@H]([C@@H](CN1CC(=O)NCC=C)c1ccc2OCOc2c1)C(O)=O