Reaction Details
TargetAdenosine receptor A1
LigandBDBM50004566
Substrate/Competitorn/a
Meas. Tech.ChEMBL_29479 (CHEMBL640472)
Ki 6.4±n/a nM
Citation Baraldi, PGCacciari, BSpalluto, GPineda de las Infantas y Villatoro, MJZocchi, CDionisotti, SOngini, E Pyrazolo[4,3-e]-1,2,4-triazolo[1,5-c]pyrimidine derivatives: potent and selective A(2A) adenosine antagonists. J Med Chem39:1164-71 (1996) 
 
Adenosine receptor A1
Name:Adenosine receptor A1
Type:Protein
Mol. Mass.:36704.13
Organism:Rattus norvegicus (rat)
Description:n/a
Residue:326
BDBM50004566
NameBDBM50004566
Synonyms:9-Chloro-2-furan-2-yl-[1,2,4]triazolo[1,5-c]quinazolin-5-ylamine 9-Chloro-[1,2,4]triazolo[1,5-c]quinazolin-5-ylamine(CGS 15943) 9-chloro-2-(furan-2-yl)-[1,2,4]triazolo[1,5-c]quinazolin-5-amine CHEMBL16687 Nonnucleoside analog, 4
TypeSmall organic molecule
Emp. Form.C13H8ClN5O
Mol. Mass.285.689
SMILESNc1nc2ccc(Cl)cc2c2nc(nn12)-c1ccco1