Reaction Details
TargetEpidermal growth factor receptor
LigandBDBM50051297
Substrate/Competitorn/a
Meas. Tech.ChEMBL_67042 (CHEMBL677880)
IC50 29±n/a nM
Citation Traxler, PMFuret, PMett, HBuchdunger, EMeyer, TLydon, N 4-(Phenylamino)pyrrolopyrimidines: potent and selective, ATP site directed inhibitors of the EGF-receptor protein tyrosine kinase. J Med Chem39:2285-92 (1996) 
 
Epidermal growth factor receptor
Name:Epidermal growth factor receptor
Type:Receptor Kinase Domain
Mol. Mass.:134279.59
Organism:Homo sapiens (Human)
Description:P00533
Residue:1210
BDBM50051297
NameBDBM50051297
Synonyms:(3-Chloro-phenyl)-(6,7,8,9-tetrahydro-5H-pyrimido[4,5-b]indol-4-yl)-amine | CHEMBL75177
TypeSmall organic molecule
Emp. Form.C16H15ClN4
Mol. Mass.298.77
SMILESClc1cccc(Nc2ncnc3[nH]c4CCCCc4c23)c1