Reaction Details
TargetAdenosine receptor A1
LigandBDBM50051337
Substrate/Competitorn/a
Meas. Tech.ChEMBL_29152 (CHEMBL639432)
Ki 1100±n/a nM
Citation Karton, YJiang, JLJi, XDMelman, NOlah, MEStiles, GLJacobson, KA Synthesis and biological activities of flavonoid derivatives as A3 adenosine receptor antagonists. J Med Chem39:2293-301 (1996) 
 
Adenosine receptor A1
Name:Adenosine receptor A1
Type:Protein
Mol. Mass.:36704.13
Organism:Rattus norvegicus (rat)
Description:n/a
Residue:326
BDBM50051337
NameBDBM50051337
Synonyms:2-Phenyl-3,5,7-tripropoxy-chromen-4-one | CHEMBL76273
TypeSmall organic molecule
Emp. Form.C24H28O5
Mol. Mass.396.4761
SMILESCCCOc1cc(OCCC)c2c(c1)oc(-c1ccccc1)c(OCCC)c2=O