Reaction Details
TargetAdenosine receptor A3
LigandBDBM50049384
Substrate/Competitorn/a
Meas. Tech.ChEMBL_31838 (CHEMBL641515)
Ki 1210±n/a nM
Citation Karton, YJiang, JLJi, XDMelman, NOlah, MEStiles, GLJacobson, KA Synthesis and biological activities of flavonoid derivatives as A3 adenosine receptor antagonists. J Med Chem39:2293-301 (1996) 
 
Adenosine receptor A3
Name:Adenosine receptor A3
Type:G Protein-Coupled Receptor (GPCR)
Mol. Mass.:36197.32
Organism:Homo sapiens (Human)
Description:P0DMS8
Residue:318
BDBM50049384
NameBDBM50049384
Synonyms:3,5,7-Trimethoxy-2-phenyl-chromen-4-one | CHEMBL75772
TypeSmall organic molecule
Emp. Form.C18H16O5
Mol. Mass.312.3166
SMILESCOc1cc(OC)c2c(c1)oc(-c1ccccc1)c(OC)c2=O