Reaction Details
TargetAdenosine receptor A1
LigandBDBM50051336
Substrate/Competitorn/a
Meas. Tech.ChEMBL_29152 (CHEMBL639432)
Ki 1890±n/a nM
Citation Karton, YJiang, JLJi, XDMelman, NOlah, MEStiles, GLJacobson, KA Synthesis and biological activities of flavonoid derivatives as A3 adenosine receptor antagonists. J Med Chem39:2293-301 (1996) 
 
Adenosine receptor A1
Name:Adenosine receptor A1
Type:Protein
Mol. Mass.:36704.13
Organism:Rattus norvegicus (rat)
Description:n/a
Residue:326
BDBM50051336
NameBDBM50051336
Synonyms:3,7-Diethoxy-5-hydroxy-2-phenyl-chromen-4-one | CHEMBL449090
TypeSmall organic molecule
Emp. Form.C19H18O5
Mol. Mass.326.3432
SMILESCCOc1cc(O)c2c(c1)oc(-c1ccccc1)c(OCC)c2=O