Reaction Details
TargetAdenosine receptor A1
LigandBDBM50051347
Substrate/Competitorn/a
Meas. Tech.ChEMBL_29152 (CHEMBL639432)
Ki 603±n/a nM
Citation Karton, YJiang, JLJi, XDMelman, NOlah, MEStiles, GLJacobson, KA Synthesis and biological activities of flavonoid derivatives as A3 adenosine receptor antagonists. J Med Chem39:2293-301 (1996) 
 
Adenosine receptor A1
Name:Adenosine receptor A1
Type:Protein
Mol. Mass.:36704.13
Organism:Rattus norvegicus (rat)
Description:n/a
Residue:326
BDBM50051347
NameBDBM50051347
Synonyms:3,5,7-Triethoxy-2-phenyl-chromen-4-one | CHEMBL72862
TypeSmall organic molecule
Emp. Form.C21H22O5
Mol. Mass.354.3964
SMILESCCOc1cc(OCC)c2c(c1)oc(-c1ccccc1)c(OCC)c2=O