Reaction Details
TargetAdenosine receptor A1
LigandBDBM50051354
Substrate/Competitorn/a
Meas. Tech.ChEMBL_29152 (CHEMBL639432)
Ki 2480±n/a nM
Citation Karton, YJiang, JLJi, XDMelman, NOlah, MEStiles, GLJacobson, KA Synthesis and biological activities of flavonoid derivatives as A3 adenosine receptor antagonists. J Med Chem39:2293-301 (1996) 
 
Adenosine receptor A1
Name:Adenosine receptor A1
Type:Protein
Mol. Mass.:36704.13
Organism:Rattus norvegicus (rat)
Description:n/a
Residue:326
BDBM50051354
NameBDBM50051354
Synonyms:3-Chloro-2-phenyl-chromen-4-one | CHEMBL74975
TypeSmall organic molecule
Emp. Form.C15H9ClO2
Mol. Mass.256.684
SMILESClc1c(oc2ccccc2c1=O)-c1ccccc1