Reaction Details
TargetXanthine dehydrogenase/oxidase
LigandBDBM50051727
Substrate/Competitorn/a
Meas. Tech.ChEMBL_217080 (CHEMBL823476)
Ki 155±n/a nM
Citation Biagi, GCostantini, ACostantino, LGiorgi, ILivi, OPecorari, PRinaldi, MScartoni, V Synthesis and biological evaluation of new imidazole, pyrimidine, and purine derivatives and analogs as inhibitors of xanthine oxidase. J Med Chem39:2529-35 (1996) 
 
Xanthine dehydrogenase/oxidase
Name:Xanthine dehydrogenase/oxidase
Type:Enzyme
Mol. Mass.:146441.21
Organism:Homo sapiens (Human)
Description:P47989
Residue:1333
BDBM50051727
NameBDBM50051727
Synonyms:2-Pentylsulfanyl-1,9-dihydro-purin-6-one | CHEMBL86021
TypeSmall organic molecule
Emp. Form.C10H14N4OS
Mol. Mass.238.309
SMILESCCCCCSc1nc2nc[nH]c2c(=O)[nH]1