Reaction Details
TargetXanthine dehydrogenase/oxidase
LigandBDBM50051741
Substrate/Competitorn/a
Meas. Tech.ChEMBL_217080 (CHEMBL823476)
Ki>100000±n/a nM
Citation Biagi, GCostantini, ACostantino, LGiorgi, ILivi, OPecorari, PRinaldi, MScartoni, V Synthesis and biological evaluation of new imidazole, pyrimidine, and purine derivatives and analogs as inhibitors of xanthine oxidase. J Med Chem39:2529-35 (1996) 
 
Xanthine dehydrogenase/oxidase
Name:Xanthine dehydrogenase/oxidase
Type:Enzyme
Mol. Mass.:146441.21
Organism:Homo sapiens (Human)
Description:P47989
Residue:1333
BDBM50051741
NameBDBM50051741
Synonyms:2-Hydroxy-7-methyl-7,8-dihydro-3H,6H-5-thia-1,3,4,8a-tetraaza-cyclopenta[b]naphthalen-9-one | CHEMBL315417
TypeSmall organic molecule
Emp. Form.C9H10N4O2S
Mol. Mass.238.266
SMILESCC1CSc2nc3[nH]c(=O)[nH]c3c(=O)n2C1